Home > Syntax Error > Qmake Syntax Error Word Unexpected Expecting

Qmake Syntax Error Word Unexpected Expecting

Contents

Saying "the what" to ask about something I don't understand How can a nine tailed fox catch its prey? I have "Qt 4.6.3(Qt)" for the new version but can not find a ToolChain that builds without complaining about the FileFormat and Relocations in generic ELF Reply ganeshredcobra says: October 27, You might need to modify the include and library search paths by editing QMAKE_INCDIR and QMAKE_LIBDIR in /home/tomek/Pobieranie/qt-everywhere-opensource-src-4.6.2/mkspecs/qws/linux-arm -g++. Does that have anything to do with this error? his comment is here

Should two DFAs be complete before making an intersection of them? [email protected]:~/Qt/build/qt-everywhere-opensource-src-4.8.6$ ./configure -embedded arm -xplatform qws/linux-arm-gnueabi-g++ -little-endian -opensource -host-little-endian -confirm-license -nomake demos -nomake examples -prefix $ZYNQ_QT_INSTALL This is the Qt for Embedded Linux Open Source Edition. Thanks Reply ganeshredcobra says: June 11, 2012 at 5:53 am i think you made some error in editing the qmake.conf file Reply DzungDang says: June 11, 2012 at 7:06 am I i also copied the lib folder in qt and tslib to mini2440 rootfilesystem usr/local.i connected to mini2440 through NFS.I go to mnt/demos/embedded/fluidlauncher.when i try to run fluid launcher application,following error occures. https://forum.qt.io/topic/49834/errors-like-qmake-syntax-error-word-unexpected-expecting-occur-when-configuring-qt-environment

Line 1 Syntax Error Word Unexpected Expecting

WaRP 7 Read More NEWS   10 Nov 2015 7 playful uses for NFC in gaming Read More NEWS   6 Nov 2015 Meet an NFC innovator: Speech Code Read More NEWS   5 Unpacking autoconf (from …/autoconf_2.65-3ubuntu1_all.deb) … Selecting previously deselected package autotools-dev. It needed some changes but finally it started to compile but it stoped and I received error: [...] /home/tomek/Pobieranie/qt-everywhere-opensource-src-4.6.2/bin/qmake: 1: Syntax error: word unexpected (expecting ")") /home/tomek/Pobieranie/qt-everywhere-opensource-src-4.6.2/bin/qmake: 1: Syntax error: word Reply gene says: October 16, 2012 at 1:37 pm with some adjustments I got Qt to compile (Ubuntu-12.04(32) on 64 bit workstation) but had to drop the -qt-mouse option.

Not the answer you're looking for? While running make I am getting this error: make[1]: Entering directory `/home/olcay/qt-embedded/src/corelib' arm-angstrom-linux-gnueabi-g++ -c -pipe -fno-exceptions -O2 -Wall -W -D_REENTRANT -fPIC -DQT_SHARED -DQT_BUILD_CORE_LIB -DQT_NO_USING_NAMESPACE -DQT_NO_CAST_TO_ASCII -DQT_ASCII_CAST_WARNINGS -DQT3_SUPPORT -DQT_MOC_COMPAT -DHB_EXPORT=Q_CORE_EXPORT -DQT_NO_DEBUG -I../../mkspecs/qws/linux-arm-g++ project.o: could not read symbols: File in wrong format collect2: ld returned 1 exit status make: *** [/usr/local/qt-everywhere-opensource-src-4.6.3/bin/qmake] Error 1 please help me Reply sushant says: July 9, 2014 at 11:01 Syntax Error Word Unexpected (expecting ) ) Ubuntu How to do ".zip just by right click and extract." ?

Reply ganeshredcobra says: June 12, 2012 at 6:16 am go the directory usr/local/lib/ and check whether the library file libts-1.0.so.0 exists or not if yesmake a soft link it will solve and i tried the command maek -debug=m [email protected]:/usr/local/qt-everywhere-opensource-src-4.6.3# make -debug=m GNU Make 3.81 Copyright (C) 2006 Free Software Foundation, Inc. No such file or directory". http://stackoverflow.com/questions/8366721/error-while-compiling-qt-embedded-for-beagleboard-arm Reply Quote 0 SGaist Lifetime Qt Champion last edited by Hi and welcome to devnet, While this error doesn't ring a bell, I just wanted to check if I understood you

Am I doing something wrong? Python Syntax Error: Word Unexpected (expecting ")") antifish 2011-08-15 13:28:21 For the tslib problem: (i dont know about big/little endian) First, download & compile TSLib $ mkdir /home/user/tslib $ cd /home/user/tslib $ git clone http://github.com/kergoth/tslib.git $ cd tslib You might need to modify the include and library search paths by editing QMAKE_INCDIR and QMAKE_LIBDIR in Ravikumar 2014-02-18 14:38:55 Help to solve the below error, The tslib functionality test failed! asked 4 years ago viewed 2609 times active 4 years ago Blog Stack Overflow Podcast #92 - The Guerilla Guide to Interviewing Get the weekly newsletter!

  1. No such file or directory".
  2. Note that registered members see fewer ads, and ContentLink is completely disabled once you log in.
  3. Reply pavan bobba says: June 24, 2014 at 7:01 am Hello,i completely install qt and tslib.compile my qt without any error.

Syntax Error Word Unexpected (expecting ) ) Makefile

I've tried sudo apt-get build-essential: [email protected]:/usr/local/qt-everywhere-opensource-src-4.6.2# sudo apt-get install build-essential Reading package lists… Done Building dependency tree Reading state information… Done build-essential is already the newest version. To solve problem with the "-qt-mouse-tslib" on the Qt cross-compilation, I inserted the line (after QMAKE_LIBDIR): QMAKE_LFLAGS += -Wl,-rpath-link=/usr/local/tslib/lib on the file "mkspecs/qws/linux-arm-g++/qmake.conf" and removed all lines until the "load(qt_config)". Line 1 Syntax Error Word Unexpected Expecting Please let me know the detail of that. Syntax Error Word Unexpected (expecting ) ) Shell Script more stack exchange communities company blog Stack Exchange Inbox Reputation and Badges sign up log in tour help Tour Start here for a quick overview of the site Help Center Detailed

Reply ganeshredcobra says: October 27, 2012 at 3:07 pm according to my knowledge this may occur due to two reasons…one is that you may miss typed or dropped some part of this content I have modified the qmake.conf inside "~/qt-everywhere-opensource-src-4.8.2/mkspecs/qws/linux-arm-g++" to : " # # qmake configuration for building with arm-linux-g++ # include(../../common/linux.conf) include(../../common/gcc-base-unix.conf) include(../../common/g++-unix.conf) include(../../common/qws.conf) #GD QMAKE_CC = /home/george/ti-sdk-am37x-evm-05.05.00.00/linux-devkit/bin/arm-arago-linux-gnueabi-gcc QMAKE_CXX = /home/george/ti-sdk-am37x-evm-05.05.00.00/linux-devkit/bin/arm-arago-linux-gnueabi-g++ QMAKE_LINK [email protected]:/usr/local/tslib$ ./autogen.sh ./autogen.sh: 3: autoreconf: not found Reply ganeshredcobra says: June 1, 2012 at 10:33 am sudo apt-get install autoreconf try this Reply Jack Nguyen says: June 1, 2012 at 12:45 I've cross compiled TSLIB and now I'm trying to cross compile QT with Paolo manual. Emulator Syntax Error Word Unexpected Expecting

I am very much sure about qmake.conf and permission on tslib and qt source. There is NO warranty; not even for MERCHANTABILITY or FITNESS FOR A PARTICULAR PURPOSE. Creating qmake. weblink add a comment| 3 Answers 3 active oldest votes up vote 1 down vote accepted An answer to this seems to be posted in the instructions to which you linked.

Registration is quick, simple and absolutely free. Syntax Error: Word Unexpected (expecting ")") Bash Not the answer you're looking for? So here is the configure line I'm using : ./configure -embedded arm-gnueabi -qt-freetype -embedded arm-gnueabi -plugin-gfx-directfb -xplatform qws/linux-arm-gnueabi-g++ The compiler I what to use is in the PATH and I precise

In that case, when the system fails to recognise it as a native executable, the invoking application would try to run sh on it as if it was a shell script,

Reply sa says: October 29, 2015 at 10:50 am Original Poster Rep: Reputation: Disabled 1. I just want make sure, my source codes is qt-everywhtere-opensource-src-4.8.6.tar.gz I extracted it by tar -xcvf qt-everywhtere-opensource-src-4.8.6.tar.gz on command line. Reply gene says: October 18, 2012 at 1:19 pm All my research confirms that I need the -qt-sql-mysql but apparently there are additional issues to resolve in making it work. Syntax Error Word Unexpected (expecting ) ) Android Studio you must rebuild DirectFB by Cross Compile arm, you cant use package libdirectfb-1.0-0 and libdirectfb-dev on Ubuntu Thành Viên Mới8th February 2011, 09:15hi all, the first, you must test by cd

Because in the /usr/local/arm/4.3.2/bin folder, i cant find arm-none-linux-gnueabi-gcc I can only find arm-none-linux-gnueabi-gcc-4.3.2 Please confirm. Does the code terminate? Instead of try extracting using unzip -a .zip. check over here animation/qabstractanimation.cpp:1:0: error: bad value (armv4t) for -march= switch animation/qabstractanimation.cpp:1:0: error: bad value (arm920t) for -mtune= switch Reply Ravikumar says: February 18, 2014 at 8:06 am Hi, Can I get a complete

what should i do ?? I've used installing manual from Paolo: http://www.sereno-online.com/site/2010/05/01/qt-4-6-2-installation-proce... Help me remember which is which: "humoro" and "humuro" Is it safe for a CR2032 coin cell to be in an oven? no targets specified and no make file found.stop so the ./configure is failed again so pls give the ./configure command without tslib because i'm not sure that i'm using it without

I have managed to compile Qt5 on the Pi itself, including creating a qmake on the Pi. For that whatever Export (export PATH=/usr/local/arm/4.3.2/bin:$PATH etc.) we did in step during tslib installation, we have to undo all of that. Pass option "-plugin-sql-mysql" to configure – this will compile MySQL support as plugin. Besides, though I'd like to try make confclean just in case, there's no Makefile any longer.

I've read some topics about installing QT, and I've decided to install it myself too. Anatoly Juergen Beisert 2011-08-14 20:54:42 Do you use a special bootloader for big endian? For example: you don't have mips-linux-g++ but you have mipsel-linux-g++ then, place where the croos compiler is and: [email protected]$ln -s mipsel-linux-g++ mips-linux-g++ bye Agrou3rd December 2010, 12:15I do have the same But now, i am getting the error "error while loading shared libraries: libQtGui.so.4 cannot open shared object file.

www.edeltech.ch Reply Quote 0 netadi last edited by I also installed Qt desktop version and had been changed the environment variables and PATH for the desktop setting. Jack. This is free software; see the source for copying conditions. Am trying to compile qt 4.6.3 for friendlyarm.

www.edeltech.ch Reply Quote 0 netadi last edited by Thanks for your support anywayz!